Reaction Details
TargetPlatelet-activating factor acetylhydrolase
LigandBDBM50182419
Substrate/Competitorn/a
Meas. Tech.ChEMBL_1584540 (CHEMBL3820395)
IC50 9.5±n/a nM
Citation Woolford, AJPero, JEAravapalli, SBerdini, VCoyle, JEDay, PJDodson, AMGrondin, PHolding, FPLee, LYLi, PManas, ESMarino, JMartin, ACMcCleland, BWMcMenamin, RLMurray, CWNeipp, CEPage, LWPatel, VKPotvain, FRich, SRivero, RASmith, KSomers, DOTrottet, LVelagaleti, RWilliams, GXie, R Exploitation of a Novel Binding Pocket in Human Lipoprotein-Associated Phospholipase A2 (Lp-PLA2) Discovered through X-ray Fragment Screening. J Med Chem59:5356-67 (2016) 
 
Platelet-activating factor acetylhydrolase
Name:Platelet-activating factor acetylhydrolase
Type:PROTEIN
Mol. Mass.:50084.41
Organism:Homo sapiens (Human)
Description:ChEMBL_156212
Residue:441
BDBM50182419
NameBDBM50182419
Synonyms:CHEMBL3819444
TypeSmall organic molecule
Emp. Form.C21H24N2O2S
Mol. Mass.368.492
SMILESCOC(CO)Cc1csc(Nc2ccc(C)c(c2)-c2ccccc2C)n1