Reaction Details
TargetPlatelet-activating factor acetylhydrolase
LigandBDBM50182421
Substrate/Competitorn/a
Meas. Tech.ChEMBL_1584542 (CHEMBL3820397)
IC50 28±n/a nM
Citation Woolford, AJPero, JEAravapalli, SBerdini, VCoyle, JEDay, PJDodson, AMGrondin, PHolding, FPLee, LYLi, PManas, ESMarino, JMartin, ACMcCleland, BWMcMenamin, RLMurray, CWNeipp, CEPage, LWPatel, VKPotvain, FRich, SRivero, RASmith, KSomers, DOTrottet, LVelagaleti, RWilliams, GXie, R Exploitation of a Novel Binding Pocket in Human Lipoprotein-Associated Phospholipase A2 (Lp-PLA2) Discovered through X-ray Fragment Screening. J Med Chem59:5356-67 (2016) 
 
Platelet-activating factor acetylhydrolase
Name:Platelet-activating factor acetylhydrolase
Type:PROTEIN
Mol. Mass.:50084.41
Organism:Homo sapiens (Human)
Description:ChEMBL_156212
Residue:441
BDBM50182421
NameBDBM50182421
Synonyms:CHEMBL3817896
TypeSmall organic molecule
Emp. Form.C23H29N3O3S
Mol. Mass.427.56
SMILESCOC(CO)Cc1csc(Nc2cc(c(C)cc2OCCN)-c2ccccc2C)n1