Reaction Details
TargetPlatelet-activating factor acetylhydrolase
LigandBDBM50182424
Substrate/Competitorn/a
Meas. Tech.ChEMBL_1584543 (CHEMBL3820398)
Kd 980000±n/a nM
Citation Woolford, AJPero, JEAravapalli, SBerdini, VCoyle, JEDay, PJDodson, AMGrondin, PHolding, FPLee, LYLi, PManas, ESMarino, JMartin, ACMcCleland, BWMcMenamin, RLMurray, CWNeipp, CEPage, LWPatel, VKPotvain, FRich, SRivero, RASmith, KSomers, DOTrottet, LVelagaleti, RWilliams, GXie, R Exploitation of a Novel Binding Pocket in Human Lipoprotein-Associated Phospholipase A2 (Lp-PLA2) Discovered through X-ray Fragment Screening. J Med Chem59:5356-67 (2016) 
 
Platelet-activating factor acetylhydrolase
Name:Platelet-activating factor acetylhydrolase
Type:PROTEIN
Mol. Mass.:50084.41
Organism:Homo sapiens (Human)
Description:ChEMBL_156212
Residue:441
BDBM50182424
NameBDBM50182424
Synonyms:CHEMBL3818090
TypeSmall organic molecule
Emp. Form.C11H10FNO
Mol. Mass.191.2016
SMILESFc1cccc(c1)C(=O)N1CC=CC1