Reaction Details
TargetPlatelet-activating factor acetylhydrolase
LigandBDBM50182425
Substrate/Competitorn/a
Meas. Tech.ChEMBL_1586600 (CHEMBL3821821)
IC50 100000±n/a nM
Citation Woolford, AJPero, JEAravapalli, SBerdini, VCoyle, JEDay, PJDodson, AMGrondin, PHolding, FPLee, LYLi, PManas, ESMarino, JMartin, ACMcCleland, BWMcMenamin, RLMurray, CWNeipp, CEPage, LWPatel, VKPotvain, FRich, SRivero, RASmith, KSomers, DOTrottet, LVelagaleti, RWilliams, GXie, R Exploitation of a Novel Binding Pocket in Human Lipoprotein-Associated Phospholipase A2 (Lp-PLA2) Discovered through X-ray Fragment Screening. J Med Chem59:5356-67 (2016) 
 
Platelet-activating factor acetylhydrolase
Name:Platelet-activating factor acetylhydrolase
Type:PROTEIN
Mol. Mass.:50084.41
Organism:Homo sapiens (Human)
Description:ChEMBL_156212
Residue:441
BDBM50182425
NameBDBM50182425
Synonyms:CHEMBL3819345
TypeSmall organic molecule
Emp. Form.C13H12ClN
Mol. Mass.217.694
SMILESCc1ccc(N)cc1-c1ccccc1Cl