Reaction Details
TargetPlatelet-activating factor acetylhydrolase
LigandBDBM12414
Substrate/Competitorn/a
Meas. Tech.ChEMBL_1586600 (CHEMBL3821821)
IC50>1000000±n/a nM
Citation Woolford, AJPero, JEAravapalli, SBerdini, VCoyle, JEDay, PJDodson, AMGrondin, PHolding, FPLee, LYLi, PManas, ESMarino, JMartin, ACMcCleland, BWMcMenamin, RLMurray, CWNeipp, CEPage, LWPatel, VKPotvain, FRich, SRivero, RASmith, KSomers, DOTrottet, LVelagaleti, RWilliams, GXie, R Exploitation of a Novel Binding Pocket in Human Lipoprotein-Associated Phospholipase A2 (Lp-PLA2) Discovered through X-ray Fragment Screening. J Med Chem59:5356-67 (2016) 
 
Platelet-activating factor acetylhydrolase
Name:Platelet-activating factor acetylhydrolase
Type:PROTEIN
Mol. Mass.:50084.41
Organism:Homo sapiens (Human)
Description:ChEMBL_156212
Residue:441
BDBM12414
NameBDBM12414
Synonyms:CHEMBL27601 hCA inhibitor, 6
TypeSmall organic molecule
Emp. Form.C6H7NO2S
Mol. Mass.157.19
SMILESNS(=O)(=O)c1ccccc1