Reaction Details
TargetCarbonic anhydrase 14
LigandBDBM10880
Substrate/Competitorn/a
Meas. Tech.ChEMBL_1586610 (CHEMBL3821965)
Ki 41±n/a nM
Citation Mujumdar, PTeruya, KTonissen, KFVullo, DSupuran, CTPeat, TSPoulsen, SA An Unusual Natural Product Primary Sulfonamide: Synthesis, Carbonic Anhydrase Inhibition, and Protein X-ray Structures of Psammaplin C. J Med Chem59:5462-70 (2016) 
 
Carbonic anhydrase 14
Name:Carbonic anhydrase 14
Type:Enzyme
Mol. Mass.:37665.67
Organism:Homo sapiens (Human)
Description:Human (cloned) isozyme.
Residue:337
BDBM10880
NameBDBM10880
Synonyms:AZA AZM acetazolamide Acetazolamide Acetazolamide (AZA) Acetazolamide, 5 Acetazolamide, AZA CHEMBL20 Sulfonamide, 1 US11278534, Example acetazolamide sulfonamide 1
TypeSmall organic molecule
Emp. Form.C4H6N4O3S2
Mol. Mass.222.245
SMILESCC(=O)Nc1nnc(s1)S(N)(=O)=O