Reaction Details
TargetCarbonic anhydrase 7
LigandBDBM50092612
Substrate/Competitorn/a
Meas. Tech.ChEMBL_1586606 (CHEMBL3821827)
Ki 1.7±n/a nM
Citation Mujumdar, PTeruya, KTonissen, KFVullo, DSupuran, CTPeat, TSPoulsen, SA An Unusual Natural Product Primary Sulfonamide: Synthesis, Carbonic Anhydrase Inhibition, and Protein X-ray Structures of Psammaplin C. J Med Chem59:5462-70 (2016) 
 
Carbonic anhydrase 7
Name:Carbonic anhydrase 7
Type:Enzyme
Mol. Mass.:29664.11
Organism:Homo sapiens (Human)
Description:Human cloned isozyme.
Residue:264
BDBM50092612
NameBDBM50092612
Synonyms:CHEMBL3586274
TypeSmall organic molecule
Emp. Form.C11H14BrN3O5S
Mol. Mass.380.215
SMILESNS(=O)(=O)CCNC(=O)C(\Cc1ccc(O)c(Br)c1)=N\O