Reaction Details
TargetCarbonic anhydrase 6
LigandBDBM50092612
Substrate/Competitorn/a
Meas. Tech.ChEMBL_1586605 (CHEMBL3821826)
Ki 9680±n/a nM
Citation Mujumdar, PTeruya, KTonissen, KFVullo, DSupuran, CTPeat, TSPoulsen, SA An Unusual Natural Product Primary Sulfonamide: Synthesis, Carbonic Anhydrase Inhibition, and Protein X-ray Structures of Psammaplin C. J Med Chem59:5462-70 (2016) 
 
Carbonic anhydrase 6
Name:Carbonic anhydrase 6
Type:Enzyme
Mol. Mass.:35371.40
Organism:Homo sapiens (Human)
Description:P23280
Residue:308
BDBM50092612
NameBDBM50092612
Synonyms:CHEMBL3586274
TypeSmall organic molecule
Emp. Form.C11H14BrN3O5S
Mol. Mass.380.215
SMILESNS(=O)(=O)CCNC(=O)C(\Cc1ccc(O)c(Br)c1)=N\O