Reaction Details
TargetHepatocyte growth factor receptor
LigandBDBM50182494
Substrate/Competitorn/a
Meas. Tech.ChEBML_1585992
IC50>1000±n/a nM
Citation Zhao, JFang, LZhang, XLiang, YGou, S Synthesis and biological evaluation of new [1,2,4]triazolo[4,3-a]pyridine derivatives as potential c-Met inhibitors. Bioorg Med Chem24:3483-93 (2016) 
 
Hepatocyte growth factor receptor
Name:Hepatocyte growth factor receptor
Type:Protein
Mol. Mass.:155559.73
Organism:Homo sapiens (Human)
Description:P08581
Residue:1390
BDBM50182494
NameBDBM50182494
Synonyms:CHEMBL3817891 | US9512121, 13
TypeSmall organic molecule
Emp. Form.C23H17F2N7O3S
Mol. Mass.509.488
SMILESCN1C(=O)COc2c1cnc1ccc(Sc3nnc4c(OC(F)F)cc(cn34)-c3cnn(C)c3)cc21