Reaction Details
Target5-hydroxytryptamine receptor 2A
LigandBDBM50182749
Substrate/Competitorn/a
Meas. Tech.ChEMBL_1586509 (CHEMBL3821448)
Ki 23±n/a nM
Citation Ofori, EZhu, XYEtukala, JRPeprah, KJordan, KRAdkins, AABricker, BAKang, HJHuang, XPRoth, BLAblordeppey, SY Design and synthesis of dual 5-HT1A and 5-HT7 receptor ligands. Bioorg Med Chem24:3464-71 (2016) 
 
5-hydroxytryptamine receptor 2A
Name:5-hydroxytryptamine receptor 2A
Type:undefined
Mol. Mass.:52607.65
Organism:Homo sapiens (Human)
Description:P28223
Residue:471
BDBM50182749
NameBDBM50182749
Synonyms:CHEMBL3818200
TypeSmall organic molecule
Emp. Form.C20H20N2O
Mol. Mass.304.3856
SMILESO=C(CCCN1CCc2ccccc2C1)c1ccc(cc1)C#N