Reaction Details
TargetD(3) dopamine receptor
LigandBDBM50182742
Substrate/Competitorn/a
Meas. Tech.ChEMBL_1586514 (CHEMBL3821453)
Ki 17±n/a nM
Citation Ofori, EZhu, XYEtukala, JRPeprah, KJordan, KRAdkins, AABricker, BAKang, HJHuang, XPRoth, BLAblordeppey, SY Design and synthesis of dual 5-HT1A and 5-HT7 receptor ligands. Bioorg Med Chem24:3464-71 (2016) 
 
D(3) dopamine receptor
Name:D(3) dopamine receptor
Type:n/a
Mol. Mass.:44243.43
Organism:Homo sapiens (Human)
Description:n/a
Residue:400
BDBM50182742
NameBDBM50182742
Synonyms:CHEMBL3818047
TypeSmall organic molecule
Emp. Form.C19H20ClNO
Mol. Mass.313.821
SMILESClc1ccc(cc1)C(=O)CCCN1CCc2ccccc2C1