Reaction Details
Target5-hydroxytryptamine receptor 7
LigandBDBM50182739
Substrate/Competitorn/a
Meas. Tech.ChEMBL_1586510 (CHEMBL3821449)
Ki 12±n/a nM
Citation Ofori, EZhu, XYEtukala, JRPeprah, KJordan, KRAdkins, AABricker, BAKang, HJHuang, XPRoth, BLAblordeppey, SY Design and synthesis of dual 5-HT1A and 5-HT7 receptor ligands. Bioorg Med Chem24:3464-71 (2016) 
 
5-hydroxytryptamine receptor 7
Name:5-hydroxytryptamine receptor 7
Type:G Protein-Coupled Receptor (GPCR)
Mol. Mass.:53573.08
Organism:Homo sapiens (Human)
Description:P34969
Residue:479
BDBM50182739
NameBDBM50182739
Synonyms:CHEMBL3819427
TypeSmall organic molecule
Emp. Form.C20H22N2O2
Mol. Mass.322.4009
SMILESNC(=O)c1ccc(cc1)C(=O)CCCN1CCc2ccccc2C1