Reaction Details
TargetCytochrome P450 3A4
LigandBDBM50183021
Substrate/Competitorn/a
Meas. Tech.ChEMBL_1586157 (CHEMBL3821253)
IC50>20000±n/a nM
Citation Laufer, RLi, SWLiu, YNg, GLang, YFeher, MBrokx, RBeletskaya, IHodgson, RMao, GPlotnikova, OAwrey, DEMason, JMWei, XLin, DCChe, YKiarash, RMadeira, BFletcher, GCMak, TWBray, MRPauls, HW Discovery of 4-(4-aminopyrazolo[1,5-a][1,3,5]triazin-8-yl)benzamides as novel, highly potent and selective, orally bioavailable inhibitors of Tyrosine Threonine Kinase, TTK. Bioorg Med Chem Lett26:3562-6 (2016) 
 
Cytochrome P450 3A4
Name:Cytochrome P450 3A4
Type:Enzyme
Mol. Mass.:57349.57
Organism:Homo sapiens (Human)
Description:n/a
Residue:503
BDBM50183021
NameBDBM50183021
Synonyms:CHEMBL3818646
TypeSmall organic molecule
Emp. Form.C28H28F2N6O3
Mol. Mass.534.5571
SMILESCc1cc(ccc1C(=O)NC1CC1)-c1cnn2c(NCC3CCOCC3)nc(Oc3cccc(F)c3F)nc12