Reaction Details
TargetDual specificity protein kinase TTK
LigandBDBM50183033
Substrate/Competitorn/a
Meas. Tech.ChEMBL_1586153 (CHEMBL3821249)
IC50 10.0±n/a nM
Citation Laufer, RLi, SWLiu, YNg, GLang, YFeher, MBrokx, RBeletskaya, IHodgson, RMao, GPlotnikova, OAwrey, DEMason, JMWei, XLin, DCChe, YKiarash, RMadeira, BFletcher, GCMak, TWBray, MRPauls, HW Discovery of 4-(4-aminopyrazolo[1,5-a][1,3,5]triazin-8-yl)benzamides as novel, highly potent and selective, orally bioavailable inhibitors of Tyrosine Threonine Kinase, TTK. Bioorg Med Chem Lett26:3562-6 (2016) 
 
Dual specificity protein kinase TTK
Name:Dual specificity protein kinase TTK
Type:Protein
Mol. Mass.:97086.79
Organism:Homo sapiens (Human)
Description:P33981
Residue:857
BDBM50183033
NameBDBM50183033
Synonyms:CHEMBL3818914
TypeSmall organic molecule
Emp. Form.C26H33N7O2
Mol. Mass.475.5859
SMILESO=C(NC1CC1)c1ccc(cc1)-c1cnn2c(NCC3CCOCC3)nc(NC3CCCC3)nc12