Reaction Details
TargetD(4) dopamine receptor
LigandBDBM50183070
Substrate/Competitorn/a
Meas. Tech.ChEMBL_1586232 (CHEMBL3820050)
Ki 1.6±n/a nM
Citation Etukala, JRZhu, XYEyunni, SVOnyameh, EKOfori, EBricker, BAKang, HJHuang, XPRoth, BLAblordeppey, SY Development of CNS multi-receptor ligands: Modification of known D2 pharmacophores. Bioorg Med Chem24:3671-9 (2016) 
 
D(4) dopamine receptor
Name:D(4) dopamine receptor
Type:Enzyme
Mol. Mass.:48373.19
Organism:Homo sapiens (Human)
Description:P21917
Residue:419
BDBM50183070
NameBDBM50183070
Synonyms:CHEMBL3818478
TypeSmall organic molecule
Emp. Form.C25H30N4O
Mol. Mass.402.5319
SMILESO=C1NCN(c2ccccc2)C11CCN(CCCCc2c[nH]c3ccccc23)CC1