Reaction Details
Target5-hydroxytryptamine receptor 2A
LigandBDBM50183266
Substrate/Competitorn/a
Meas. Tech.ChEMBL_1586244 (CHEMBL3820062)
Ki 1.2±n/a nM
Citation Etukala, JRZhu, XYEyunni, SVOnyameh, EKOfori, EBricker, BAKang, HJHuang, XPRoth, BLAblordeppey, SY Development of CNS multi-receptor ligands: Modification of known D2 pharmacophores. Bioorg Med Chem24:3671-9 (2016) 
 
5-hydroxytryptamine receptor 2A
Name:5-hydroxytryptamine receptor 2A
Type:undefined
Mol. Mass.:52607.65
Organism:Homo sapiens (Human)
Description:P28223
Residue:471
BDBM50183266
NameBDBM50183266
Synonyms:Anquil Benquil R-4584
TypeSmall organic molecule
Emp. Form.C22H24FN3O2
Mol. Mass.381.4433
SMILESOc1nc2ccccc2n1C1CCN(CCCC(=O)c2ccc(F)cc2)CC1