Reaction Details
TargetHistamine H1 receptor
LigandBDBM50183265
Substrate/Competitorn/a
Meas. Tech.ChEMBL_1586248 (CHEMBL3820066)
Ki 504±n/a nM
Citation Etukala, JRZhu, XYEyunni, SVOnyameh, EKOfori, EBricker, BAKang, HJHuang, XPRoth, BLAblordeppey, SY Development of CNS multi-receptor ligands: Modification of known D2 pharmacophores. Bioorg Med Chem24:3671-9 (2016) 
 
Histamine H1 receptor
Name:Histamine H1 receptor
Type:G Protein-Coupled Receptor (GPCR)
Mol. Mass.:55808.72
Organism:Homo sapiens (Human)
Description:Cell pellets from SK-N-MC cells transfected with human H1 receptor were used in binding assay.
Residue:487
BDBM50183265
NameBDBM50183265
Synonyms:CHEMBL3819567
TypeSmall organic molecule
Emp. Form.C24H28N4OS
Mol. Mass.420.57
SMILESO=C1NCN(c2ccccc2)C11CCN(CCCCc2nc3ccccc3s2)CC1