Reaction Details
TargetApelin receptor
LigandBDBM50183343
Substrate/Competitorn/a
Meas. Tech.ChEMBL_1586260 (CHEMBL3820078)
Ki 1400±n/a nM
Citation Narayanan, SMaitra, RDeschamps, JRBortoff, KThomas, JBZhang, YWarner, KVasukuttan, VDecker, ARunyon, SP Discovery of a novel small molecule agonist scaffold for the APJ receptor. Bioorg Med Chem24:3758-70 (2016) 
 
Apelin receptor
Name:Apelin receptor
Type:Enzyme Catalytic Domain
Mol. Mass.:42664.06
Organism:Homo sapiens (Human)
Description:P35414
Residue:380
BDBM50183343
NameBDBM50183343
Synonyms:CHEMBL3818506
TypeSmall organic molecule
Emp. Form.C27H30FN3O5
Mol. Mass.495.5426
SMILESCOc1cccc(OC)c1-c1cc(nn1-c1ccc(F)cc1)C(=O)N[C@H](CC(O)=O)C1CCCCC1