Reaction Details
TargetBromodomain-containing protein 7
LigandBDBM50183561
Substrate/Competitorn/a
Meas. Tech.ChEMBL_1586793 (CHEMBL3826478)
IC50 108±n/a nM
Citation Martin, LJKoegl, MBader, GCockcroft, XLFedorov, OFiegen, DGerstberger, THofmann, MHHohmann, AFKessler, DKnapp, SKnesl, PKornigg, SMüller, SNar, HRogers, CRumpel, KSchaaf, OSteurer, STallant, CVakoc, CRZeeb, MZoephel, APearson, MBoehmelt, GMcConnell, D Structure-Based Design of an in Vivo Active Selective BRD9 Inhibitor. J Med Chem59:4462-75 (2016) 
 
Bromodomain-containing protein 7
Name:Bromodomain-containing protein 7
Type:PROTEIN
Mol. Mass.:74135.71
Organism:Homo sapiens (Human)
Description:ChEMBL_107970
Residue:651
BDBM50183561
NameBDBM50183561
Synonyms:CHEMBL3824146
TypeSmall organic molecule
Emp. Form.C21H24N2O3
Mol. Mass.352.4269
SMILESCOc1cc(cc(OC)c1CN(C)C)-c1cn(C)c(=O)c2ccccc12