Reaction Details
TargetBromodomain-containing protein 2
LigandBDBM50183563
Substrate/Competitorn/a
Meas. Tech.ChEMBL_1586794 (CHEMBL3826479)
IC50 33234±n/a nM
Citation Martin, LJKoegl, MBader, GCockcroft, XLFedorov, OFiegen, DGerstberger, THofmann, MHHohmann, AFKessler, DKnapp, SKnesl, PKornigg, SMüller, SNar, HRogers, CRumpel, KSchaaf, OSteurer, STallant, CVakoc, CRZeeb, MZoephel, APearson, MBoehmelt, GMcConnell, D Structure-Based Design of an in Vivo Active Selective BRD9 Inhibitor. J Med Chem59:4462-75 (2016) 
 
Bromodomain-containing protein 2
Name:Bromodomain-containing protein 2
Type:Protein
Mol. Mass.:88085.95
Organism:Homo sapiens (Human)
Description:P25440
Residue:801
BDBM50183563
NameBDBM50183563
Synonyms:CHEMBL3823697
TypeSmall organic molecule
Emp. Form.C19H26N2O3
Mol. Mass.330.4213
SMILESCOc1cc(cc(OC)c1CN(C)C)-c1cc(C)c(=O)n(C)c1C