Reaction Details
TargetBromodomain-containing protein 4
LigandBDBM50183451
Substrate/Competitorn/a
Meas. Tech.ChEMBL_1586795 (CHEMBL3826480)
IC50 67479±n/a nM
Citation Martin, LJKoegl, MBader, GCockcroft, XLFedorov, OFiegen, DGerstberger, THofmann, MHHohmann, AFKessler, DKnapp, SKnesl, PKornigg, SMüller, SNar, HRogers, CRumpel, KSchaaf, OSteurer, STallant, CVakoc, CRZeeb, MZoephel, APearson, MBoehmelt, GMcConnell, D Structure-Based Design of an in Vivo Active Selective BRD9 Inhibitor. J Med Chem59:4462-75 (2016) 
 
Bromodomain-containing protein 4
Name:Bromodomain-containing protein 4
Type:Protein
Mol. Mass.:152264.84
Organism:Homo sapiens (Human)
Description:O60885
Residue:1362
BDBM50183451
NameBDBM50183451
Synonyms:CHEMBL3823551
TypeSmall organic molecule
Emp. Form.C19H26N2O3
Mol. Mass.330.4213
SMILESCOc1cc(c(OC)cc1CN(C)C)-c1cn(C)c(=O)c(C)c1C