Reaction Details
TargetBromodomain-containing protein 9
LigandBDBM50183448
Substrate/Competitorn/a
Meas. Tech.ChEMBL_1586825 (CHEMBL3826657)
EC50 275±n/a nM
Citation Martin, LJKoegl, MBader, GCockcroft, XLFedorov, OFiegen, DGerstberger, THofmann, MHHohmann, AFKessler, DKnapp, SKnesl, PKornigg, SMüller, SNar, HRogers, CRumpel, KSchaaf, OSteurer, STallant, CVakoc, CRZeeb, MZoephel, APearson, MBoehmelt, GMcConnell, D Structure-Based Design of an in Vivo Active Selective BRD9 Inhibitor. J Med Chem59:4462-75 (2016) 
 
Bromodomain-containing protein 9
Name:Bromodomain-containing protein 9
Type:PROTEIN
Mol. Mass.:66835.46
Organism:Mus musculus
Description:ChEMBL_116811
Residue:596
BDBM50183448
NameBDBM50183448
Synonyms:CHEMBL3823478 | US11773085, Compound B2
TypeSmall organic molecule
Emp. Form.C20H23N3O3
Mol. Mass.353.4149
SMILESCOc1cc(cc(OC)c1CN(C)C)-c1cn(C)c(=O)c2cnccc12