Reaction Details
TargetBromodomain-containing protein 9
LigandBDBM50157607
Substrate/Competitorn/a
Meas. Tech.ChEMBL_1586800 (CHEMBL3826485)
IC50 5100±n/a nM
Citation Martin, LJKoegl, MBader, GCockcroft, XLFedorov, OFiegen, DGerstberger, THofmann, MHHohmann, AFKessler, DKnapp, SKnesl, PKornigg, SMüller, SNar, HRogers, CRumpel, KSchaaf, OSteurer, STallant, CVakoc, CRZeeb, MZoephel, APearson, MBoehmelt, GMcConnell, D Structure-Based Design of an in Vivo Active Selective BRD9 Inhibitor. J Med Chem59:4462-75 (2016) 
 
Bromodomain-containing protein 9
Name:Bromodomain-containing protein 9
Type:PROTEIN
Mol. Mass.:66994.30
Organism:Homo sapiens (Human)
Description:ChEMBL_108000
Residue:597
BDBM50157607
NameBDBM50157607
Synonyms:CHEMBL3753082 | US11773085, Compound B24
TypeSmall organic molecule
Emp. Form.C26H30ClN3O4S
Mol. Mass.516.052
SMILESCC(C)CS(=O)(=O)N[C@H]1CCC(=O)N([C@@H]1c1ccc(Cl)cc1)c1ccc2c(C)cc(=O)n(C)c2c1