Reaction Details
TargetBromodomain-containing protein 9
LigandBDBM50183560
Substrate/Competitorn/a
Meas. Tech.ChEMBL_1586798 (CHEMBL3826483)
IC50 250±n/a nM
Citation Martin, LJKoegl, MBader, GCockcroft, XLFedorov, OFiegen, DGerstberger, THofmann, MHHohmann, AFKessler, DKnapp, SKnesl, PKornigg, SMüller, SNar, HRogers, CRumpel, KSchaaf, OSteurer, STallant, CVakoc, CRZeeb, MZoephel, APearson, MBoehmelt, GMcConnell, D Structure-Based Design of an in Vivo Active Selective BRD9 Inhibitor. J Med Chem59:4462-75 (2016) 
 
Bromodomain-containing protein 9
Name:Bromodomain-containing protein 9
Type:PROTEIN
Mol. Mass.:66994.30
Organism:Homo sapiens (Human)
Description:ChEMBL_108000
Residue:597
BDBM50183560
NameBDBM50183560
Synonyms:CHEMBL3822909
TypeSmall organic molecule
Emp. Form.C20H23N3O3
Mol. Mass.353.4149
SMILESCOc1cc(cc(OC)c1CN(C)C)-c1cn(C)c(=O)c2ncccc12