Reaction Details
TargetBromodomain-containing protein 9
LigandBDBM50183565
Substrate/Competitorn/a
Meas. Tech.ChEMBL_1586798 (CHEMBL3826483)
IC50 48900±n/a nM
Citation Martin, LJKoegl, MBader, GCockcroft, XLFedorov, OFiegen, DGerstberger, THofmann, MHHohmann, AFKessler, DKnapp, SKnesl, PKornigg, SMüller, SNar, HRogers, CRumpel, KSchaaf, OSteurer, STallant, CVakoc, CRZeeb, MZoephel, APearson, MBoehmelt, GMcConnell, D Structure-Based Design of an in Vivo Active Selective BRD9 Inhibitor. J Med Chem59:4462-75 (2016) 
 
Bromodomain-containing protein 9
Name:Bromodomain-containing protein 9
Type:PROTEIN
Mol. Mass.:66994.30
Organism:Homo sapiens (Human)
Description:ChEMBL_108000
Residue:597
BDBM50183565
NameBDBM50183565
Synonyms:CHEMBL3824040
TypeSmall organic molecule
Emp. Form.C10H12N4O
Mol. Mass.204.2285
SMILESCN(C)c1ncc2c(ccn(C)c2=O)n1