Reaction Details
TargetPotassium voltage-gated channel subfamily H member 2
LigandBDBM50184464
Substrate/Competitorn/a
Meas. Tech.ChEMBL_1586953 (CHEMBL3825087)
IC50>33000±n/a nM
Citation Degorce, SLBoyd, SCurwen, JODucray, RHalsall, CTJones, CDLach, FLenz, EMPass, MPass, STrigwell, C Discovery of a Potent, Selective, Orally Bioavailable, and Efficacious Novel 2-(Pyrazol-4-ylamino)-pyrimidine Inhibitor of the Insulin-like Growth Factor-1 Receptor (IGF-1R). J Med Chem59:4859-66 (2016) 
 
Potassium voltage-gated channel subfamily H member 2
Name:Potassium voltage-gated channel subfamily H member 2
Type:Multi-pass membrane protein
Mol. Mass.:126672.65
Organism:Homo sapiens (Human)
Description:Q12809
Residue:1159
BDBM50184464
NameBDBM50184464
Synonyms:CHEMBL3822644
TypeSmall organic molecule
Emp. Form.C24H28ClN9O
Mol. Mass.493.992
SMILESC[C@@H](N)C(=O)N1CCC(CC1)n1nc(C)c(Nc2ncc(Cl)c(n2)-c2cnn3ccccc23)c1C