Reaction Details
TargetCyclin-dependent kinase 9
LigandBDBM50184466
Substrate/Competitorn/a
Meas. Tech.ChEMBL_1587013 (CHEMBL3825313)
IC50 37±n/a nM
Citation Degorce, SLBoyd, SCurwen, JODucray, RHalsall, CTJones, CDLach, FLenz, EMPass, MPass, STrigwell, C Discovery of a Potent, Selective, Orally Bioavailable, and Efficacious Novel 2-(Pyrazol-4-ylamino)-pyrimidine Inhibitor of the Insulin-like Growth Factor-1 Receptor (IGF-1R). J Med Chem59:4859-66 (2016) 
 
Cyclin-dependent kinase 9
Name:Cyclin-dependent kinase 9
Type:Enzyme Subunit
Mol. Mass.:42789.13
Organism:Homo sapiens (Human)
Description:n/a
Residue:372
BDBM50184466
NameBDBM50184466
Synonyms:CHEMBL3823659
TypeSmall organic molecule
Emp. Form.C21H21ClN8O
Mol. Mass.436.897
SMILESCC(=O)N1CCC(CC1)n1cc(Nc2ncc(Cl)c(n2)-c2cnc3ccccn23)cn1