Reaction Details
TargetCytochrome P450 3A4
LigandBDBM50184467
Substrate/Competitorn/a
Meas. Tech.ChEMBL_1587034 (CHEMBL3825430)
IC50<1000±n/a nM
Citation Degorce, SLBoyd, SCurwen, JODucray, RHalsall, CTJones, CDLach, FLenz, EMPass, MPass, STrigwell, C Discovery of a Potent, Selective, Orally Bioavailable, and Efficacious Novel 2-(Pyrazol-4-ylamino)-pyrimidine Inhibitor of the Insulin-like Growth Factor-1 Receptor (IGF-1R). J Med Chem59:4859-66 (2016) 
 
Cytochrome P450 3A4
Name:Cytochrome P450 3A4
Type:Enzyme
Mol. Mass.:57349.57
Organism:Homo sapiens (Human)
Description:n/a
Residue:503
BDBM50184467
NameBDBM50184467
Synonyms:CHEMBL3823297
TypeSmall organic molecule
Emp. Form.C24H24ClN7O2
Mol. Mass.477.946
SMILESCOc1cc(ccc1Nc1ncc(Cl)c(n1)-c1cnn2ccccc12)N1CCN(CC1)C(C)=O