Reaction Details
TargetCytochrome P450 3A4
LigandBDBM50184451
Substrate/Competitorn/a
Meas. Tech.ChEMBL_1587034 (CHEMBL3825430)
IC50>10000±n/a nM
Citation Degorce, SLBoyd, SCurwen, JODucray, RHalsall, CTJones, CDLach, FLenz, EMPass, MPass, STrigwell, C Discovery of a Potent, Selective, Orally Bioavailable, and Efficacious Novel 2-(Pyrazol-4-ylamino)-pyrimidine Inhibitor of the Insulin-like Growth Factor-1 Receptor (IGF-1R). J Med Chem59:4859-66 (2016) 
 
Cytochrome P450 3A4
Name:Cytochrome P450 3A4
Type:Enzyme
Mol. Mass.:57349.57
Organism:Homo sapiens (Human)
Description:n/a
Residue:503
BDBM50184451
NameBDBM50184451
Synonyms:CHEMBL3823914
TypeSmall organic molecule
Emp. Form.C23H25ClN8O
Mol. Mass.464.951
SMILESCC(=O)N1CCC(CC1)n1nc(C)c(Nc2ncc(Cl)c(n2)-c2cnn3ccccc23)c1C