Reaction Details
TargetInsulin-like growth factor 1 receptor
LigandBDBM50184468
Substrate/Competitorn/a
Meas. Tech.ChEMBL_1586949 (CHEMBL3825083)
IC50 76±n/a nM
Citation Degorce, SLBoyd, SCurwen, JODucray, RHalsall, CTJones, CDLach, FLenz, EMPass, MPass, STrigwell, C Discovery of a Potent, Selective, Orally Bioavailable, and Efficacious Novel 2-(Pyrazol-4-ylamino)-pyrimidine Inhibitor of the Insulin-like Growth Factor-1 Receptor (IGF-1R). J Med Chem59:4859-66 (2016) 
 
Insulin-like growth factor 1 receptor
Name:Insulin-like growth factor 1 receptor
Type:Protein
Mol. Mass.:154776.79
Organism:Homo sapiens (Human)
Description:P08069
Residue:1367
BDBM50184468
NameBDBM50184468
Synonyms:CHEMBL3822858
TypeSmall organic molecule
Emp. Form.C22H23ClN8O2
Mol. Mass.466.923
SMILESCOc1nn(cc1Nc1ncc(Cl)c(n1)-c1cnc2ccccn12)C1CCN(CC1)C(C)=O