Reaction Details
TargetInsulin-like growth factor 1 receptor
LigandBDBM50184469
Substrate/Competitorn/a
Meas. Tech.ChEMBL_1586949 (CHEMBL3825083)
IC50 50±n/a nM
Citation Degorce, SLBoyd, SCurwen, JODucray, RHalsall, CTJones, CDLach, FLenz, EMPass, MPass, STrigwell, C Discovery of a Potent, Selective, Orally Bioavailable, and Efficacious Novel 2-(Pyrazol-4-ylamino)-pyrimidine Inhibitor of the Insulin-like Growth Factor-1 Receptor (IGF-1R). J Med Chem59:4859-66 (2016) 
 
Insulin-like growth factor 1 receptor
Name:Insulin-like growth factor 1 receptor
Type:Protein
Mol. Mass.:154776.79
Organism:Homo sapiens (Human)
Description:P08069
Residue:1367
BDBM50184469
NameBDBM50184469
Synonyms:CHEMBL3823278
TypeSmall organic molecule
Emp. Form.C22H23ClN8O
Mol. Mass.450.924
SMILESCC(=O)N1CCC(CC1)n1cc(Nc2ncc(Cl)c(n2)-c2cnc3ccccn23)c(C)n1