Reaction Details
TargetInsulin-like growth factor 1 receptor
LigandBDBM50184457
Substrate/Competitorn/a
Meas. Tech.ChEMBL_1586949 (CHEMBL3825083)
IC50 9.0±n/a nM
Citation Degorce, SLBoyd, SCurwen, JODucray, RHalsall, CTJones, CDLach, FLenz, EMPass, MPass, STrigwell, C Discovery of a Potent, Selective, Orally Bioavailable, and Efficacious Novel 2-(Pyrazol-4-ylamino)-pyrimidine Inhibitor of the Insulin-like Growth Factor-1 Receptor (IGF-1R). J Med Chem59:4859-66 (2016) 
 
Insulin-like growth factor 1 receptor
Name:Insulin-like growth factor 1 receptor
Type:Protein
Mol. Mass.:154776.79
Organism:Homo sapiens (Human)
Description:P08069
Residue:1367
BDBM50184457
NameBDBM50184457
Synonyms:CHEMBL3823095
TypeSmall organic molecule
Emp. Form.C25H30ClN9O
Mol. Mass.508.018
SMILESCN(C)C(=O)CN1CCC(CC1)n1nc(C)c(Nc2ncc(Cl)c(n2)-c2cnn3ccccc23)c1C