Reaction Details
TargetCyclin-dependent kinase 2
LigandBDBM50184471
Substrate/Competitorn/a
Meas. Tech.ChEMBL_1586950 (CHEMBL3825084)
IC50 232±n/a nM
Citation Degorce, SLBoyd, SCurwen, JODucray, RHalsall, CTJones, CDLach, FLenz, EMPass, MPass, STrigwell, C Discovery of a Potent, Selective, Orally Bioavailable, and Efficacious Novel 2-(Pyrazol-4-ylamino)-pyrimidine Inhibitor of the Insulin-like Growth Factor-1 Receptor (IGF-1R). J Med Chem59:4859-66 (2016) 
 
Cyclin-dependent kinase 2
Name:Cyclin-dependent kinase 2
Type:Enzyme Subunit
Mol. Mass.:33938.17
Organism:Homo sapiens (Human)
Description:P24941
Residue:298
BDBM50184471
NameBDBM50184471
Synonyms:CHEMBL3822583
TypeSmall organic molecule
Emp. Form.C22H23ClN8O
Mol. Mass.450.924
SMILESCC(=O)N1CCC(CC1)n1ncc(Nc2ncc(Cl)c(n2)-c2cnc3ccccn23)c1C