Reaction Details
TargetInsulin-like growth factor 1 receptor
LigandBDBM50184454
Substrate/Competitorn/a
Meas. Tech.ChEMBL_1586952 (CHEMBL3825086)
IC50 85±n/a nM
Citation Degorce, SLBoyd, SCurwen, JODucray, RHalsall, CTJones, CDLach, FLenz, EMPass, MPass, STrigwell, C Discovery of a Potent, Selective, Orally Bioavailable, and Efficacious Novel 2-(Pyrazol-4-ylamino)-pyrimidine Inhibitor of the Insulin-like Growth Factor-1 Receptor (IGF-1R). J Med Chem59:4859-66 (2016) 
 
Insulin-like growth factor 1 receptor
Name:Insulin-like growth factor 1 receptor
Type:Protein
Mol. Mass.:154776.79
Organism:Homo sapiens (Human)
Description:P08069
Residue:1367
BDBM50184454
NameBDBM50184454
Synonyms:CHEMBL3822962
TypeSmall organic molecule
Emp. Form.C23H25ClN8O
Mol. Mass.464.951
SMILESCCc1c(Nc2ncc(Cl)c(n2)-c2cnn3ccccc23)cnn1C1CCN(CC1)C(C)=O