Reaction Details
TargetInsulin-like growth factor 1 receptor
LigandBDBM50184461
Substrate/Competitorn/a
Meas. Tech.ChEMBL_1586952 (CHEMBL3825086)
IC50 48±n/a nM
Citation Degorce, SLBoyd, SCurwen, JODucray, RHalsall, CTJones, CDLach, FLenz, EMPass, MPass, STrigwell, C Discovery of a Potent, Selective, Orally Bioavailable, and Efficacious Novel 2-(Pyrazol-4-ylamino)-pyrimidine Inhibitor of the Insulin-like Growth Factor-1 Receptor (IGF-1R). J Med Chem59:4859-66 (2016) 
 
Insulin-like growth factor 1 receptor
Name:Insulin-like growth factor 1 receptor
Type:Protein
Mol. Mass.:154776.79
Organism:Homo sapiens (Human)
Description:P08069
Residue:1367
BDBM50184461
NameBDBM50184461
Synonyms:CHEMBL3823030
TypeSmall organic molecule
Emp. Form.C24H27ClN8O2
Mol. Mass.494.977
SMILESC[C@@H](O)C(=O)N1CCC(CC1)n1nc(C)c(Nc2ncc(Cl)c(n2)-c2cnn3ccccc23)c1C