Reaction Details
TargetMitogen-activated protein kinase 14
LigandBDBM50184478
Substrate/Competitorn/a
Meas. Tech.ChEMBL_1587106 (CHEMBL3825641)
IC50>5000±n/a nM
Citation Haile, PAVotta, BJMarquis, RWBury, MJMehlmann, JFSinghaus, RCharnley, AKLakdawala, ASConvery, MALipshutz, DBDesai, BMSwift, BCapriotti, CABerger, SBMahajan, MKReilly, MARivera, EJSun, HHNagilla, RBeal, AMFinger, JNCook, MNKing, BWOuellette, MTTotoritis, RDPierdomenico, MNegroni, AStronati, LCucchiara, SZiólkowski, BVossenkämper, AMacDonald, TTGough, PJBertin, JCasillas, LN The Identification and Pharmacological Characterization of 6-(tert-Butylsulfonyl)-N-(5-fluoro-1H-indazol-3-yl)quinolin-4-amine (GSK583), a Highly Potent and Selective Inhibitor of RIP2 Kinase. J Med Chem59:4867-80 (2016) 
 
Mitogen-activated protein kinase 14
Name:Mitogen-activated protein kinase 14
Type:Serine/threonine-protein kinase
Mol. Mass.:41286.76
Organism:Homo sapiens (Human)
Description:Q16539
Residue:360
BDBM50184478
NameBDBM50184478
Synonyms:CHEMBL3823809
TypeSmall organic molecule
Emp. Form.C16H13N5O2S
Mol. Mass.339.372
SMILESCS(=O)(=O)c1ccc2nccc(Nc3ccc4[nH]nnc4c3)c2c1