Reaction Details
TargetSerine/threonine-protein kinase mTOR
LigandBDBM50184770
Substrate/Competitorn/a
Meas. Tech.ChEMBL_1587938 (CHEMBL3826741)
IC50>10000±n/a nM
Citation Fraser, CDawson, JCDowling, RHouston, DRWeiss, JTMunro, AFMuir, MHarrington, LWebster, SPFrame, MCBrunton, VGPatton, EECarragher, NOUnciti-Broceta, A Rapid Discovery and Structure-Activity Relationships of Pyrazolopyrimidines That Potently Suppress Breast Cancer Cell Growth via SRC Kinase Inhibition with Exceptional Selectivity over ABL Kinase. J Med Chem59:4697-710 (2016) 
 
Serine/threonine-protein kinase mTOR
Name:Serine/threonine-protein kinase mTOR
Type:Rapamycin target protein
Mol. Mass.:288917.12
Organism:Homo sapiens (Human)
Description:P42345
Residue:2549
BDBM50184770
NameBDBM50184770
Synonyms:CHEMBL3823849 | US10294227, Code 112
TypeSmall organic molecule
Emp. Form.C22H31N7
Mol. Mass.393.5284
SMILESCN(C)CC1CCN(CCn2nc(-c3ccc(C)cc3)c3c(N)ncnc23)CC1