Reaction Details
TargetPlatelet-derived growth factor receptor alpha
LigandBDBM50184772
Substrate/Competitorn/a
Meas. Tech.ChEMBL_1587939 (CHEMBL3826742)
IC50>10000±n/a nM
Citation Fraser, CDawson, JCDowling, RHouston, DRWeiss, JTMunro, AFMuir, MHarrington, LWebster, SPFrame, MCBrunton, VGPatton, EECarragher, NOUnciti-Broceta, A Rapid Discovery and Structure-Activity Relationships of Pyrazolopyrimidines That Potently Suppress Breast Cancer Cell Growth via SRC Kinase Inhibition with Exceptional Selectivity over ABL Kinase. J Med Chem59:4697-710 (2016) 
 
Platelet-derived growth factor receptor alpha
Name:Platelet-derived growth factor receptor alpha
Type:Protein
Mol. Mass.:122633.38
Organism:Homo sapiens (Human)
Description:P16234
Residue:1089
BDBM50184772
NameBDBM50184772
Synonyms:CHEMBL3822591 | US10294227, Code 113
TypeSmall organic molecule
Emp. Form.C23H33N7
Mol. Mass.407.555
SMILESCN(C)CCC1CCN(CCn2nc(-c3ccc(C)cc3)c3c(N)ncnc23)CC1