Reaction Details
TargetTyrosine-protein kinase ABL1
LigandBDBM25116
Substrate/Competitorn/a
Meas. Tech.ChEMBL_1587935 (CHEMBL3826738)
IC50 147±n/a nM
Citation Fraser, CDawson, JCDowling, RHouston, DRWeiss, JTMunro, AFMuir, MHarrington, LWebster, SPFrame, MCBrunton, VGPatton, EECarragher, NOUnciti-Broceta, A Rapid Discovery and Structure-Activity Relationships of Pyrazolopyrimidines That Potently Suppress Breast Cancer Cell Growth via SRC Kinase Inhibition with Exceptional Selectivity over ABL Kinase. J Med Chem59:4697-710 (2016) 
 
Tyrosine-protein kinase ABL1
Name:Tyrosine-protein kinase ABL1
Type:Enzyme
Mol. Mass.:122897.30
Organism:Homo sapiens (Human)
Description:P00519
Residue:1130
BDBM25116
NameBDBM25116
Synonyms:1-tert-butyl-3-(4-methylphenyl)-1H-pyrazolo[3,4-d]pyrimidin-4-amine PP1 US10807986, Comparative compound 1 US11701353, PP1 (Pfizer) | cid_1400
TypeSmall organic molecule
Emp. Form.C16H19N5
Mol. Mass.281.3556
SMILESCc1ccc(cc1)-c1nn(c2ncnc(N)c12)C(C)(C)C