Reaction Details
TargetTyrosine-protein kinase ABL1
LigandBDBM50184782
Substrate/Competitorn/a
Meas. Tech.ChEMBL_1587935 (CHEMBL3826738)
IC50>10000±n/a nM
Citation Fraser, CDawson, JCDowling, RHouston, DRWeiss, JTMunro, AFMuir, MHarrington, LWebster, SPFrame, MCBrunton, VGPatton, EECarragher, NOUnciti-Broceta, A Rapid Discovery and Structure-Activity Relationships of Pyrazolopyrimidines That Potently Suppress Breast Cancer Cell Growth via SRC Kinase Inhibition with Exceptional Selectivity over ABL Kinase. J Med Chem59:4697-710 (2016) 
 
Tyrosine-protein kinase ABL1
Name:Tyrosine-protein kinase ABL1
Type:Enzyme
Mol. Mass.:122897.30
Organism:Homo sapiens (Human)
Description:P00519
Residue:1130
BDBM50184782
NameBDBM50184782
Synonyms:CHEMBL3824228 | US10294227, Code 543
TypeSmall organic molecule
Emp. Form.C25H36N8O2
Mol. Mass.480.6057
SMILESCN(C)C1CCN(CCn2nc(-c3ccc(NC(=O)OC(C)(C)C)cc3)c3c(N)ncnc23)CC1