Reaction Details
TargetTyrosine-protein kinase ABL1
LigandBDBM50184786
Substrate/Competitorn/a
Meas. Tech.ChEMBL_1587935 (CHEMBL3826738)
IC50 370±n/a nM
Citation Fraser, CDawson, JCDowling, RHouston, DRWeiss, JTMunro, AFMuir, MHarrington, LWebster, SPFrame, MCBrunton, VGPatton, EECarragher, NOUnciti-Broceta, A Rapid Discovery and Structure-Activity Relationships of Pyrazolopyrimidines That Potently Suppress Breast Cancer Cell Growth via SRC Kinase Inhibition with Exceptional Selectivity over ABL Kinase. J Med Chem59:4697-710 (2016) 
 
Tyrosine-protein kinase ABL1
Name:Tyrosine-protein kinase ABL1
Type:Enzyme
Mol. Mass.:122897.30
Organism:Homo sapiens (Human)
Description:P00519
Residue:1130
BDBM50184786
NameBDBM50184786
Synonyms:CHEMBL3824116 | US10294227, Code 565
TypeSmall organic molecule
Emp. Form.C27H39N7O3
Mol. Mass.509.6437
SMILESCOc1cc(ccc1CC(=O)OC(C)(C)C)-c1nn(CCN2CCC(CC2)N(C)C)c2ncnc(N)c12