Reaction Details
TargetProto-oncogene tyrosine-protein kinase receptor Ret
LigandBDBM50184767
Substrate/Competitorn/a
Meas. Tech.ChEMBL_1587940 (CHEMBL3826743)
IC50>10000±n/a nM
Citation Fraser, CDawson, JCDowling, RHouston, DRWeiss, JTMunro, AFMuir, MHarrington, LWebster, SPFrame, MCBrunton, VGPatton, EECarragher, NOUnciti-Broceta, A Rapid Discovery and Structure-Activity Relationships of Pyrazolopyrimidines That Potently Suppress Breast Cancer Cell Growth via SRC Kinase Inhibition with Exceptional Selectivity over ABL Kinase. J Med Chem59:4697-710 (2016) 
 
Proto-oncogene tyrosine-protein kinase receptor Ret
Name:Proto-oncogene tyrosine-protein kinase receptor Ret
Type:Protein
Mol. Mass.:124318.29
Organism:Homo sapiens (Human)
Description:P07949
Residue:1114
BDBM50184767
NameBDBM50184767
Synonyms:CHEMBL3824089 | US10294227, Code 506
TypeSmall organic molecule
Emp. Form.C26H38N8O3
Mol. Mass.510.6317
SMILESCOc1cc(ccc1NC(=O)OC(C)(C)C)-c1nn(CCN2CCC(CC2)N(C)C)c2ncnc(N)c12