Reaction Details
TargetProto-oncogene tyrosine-protein kinase Src
LigandBDBM50184781
Substrate/Competitorn/a
Meas. Tech.ChEMBL_1587941 (CHEMBL3824531)
IC50 3.5±n/a nM
Citation Fraser, CDawson, JCDowling, RHouston, DRWeiss, JTMunro, AFMuir, MHarrington, LWebster, SPFrame, MCBrunton, VGPatton, EECarragher, NOUnciti-Broceta, A Rapid Discovery and Structure-Activity Relationships of Pyrazolopyrimidines That Potently Suppress Breast Cancer Cell Growth via SRC Kinase Inhibition with Exceptional Selectivity over ABL Kinase. J Med Chem59:4697-710 (2016) 
 
Proto-oncogene tyrosine-protein kinase Src
Name:Proto-oncogene tyrosine-protein kinase Src
Type:Protein
Mol. Mass.:59838.60
Organism:Homo sapiens (Human)
Description:P12931
Residue:536
BDBM50184781
NameBDBM50184781
Synonyms:CHEMBL3823543 | US10294227, Code 533
TypeSmall organic molecule
Emp. Form.C28H36N8O
Mol. Mass.500.6384
SMILESCOc1cc(ccc1NCc1ccccc1)-c1nn(CCN2CCC(CC2)N(C)C)c2ncnc(N)c12