Reaction Details
TargetProto-oncogene tyrosine-protein kinase Src
LigandBDBM50184785
Substrate/Competitorn/a
Meas. Tech.ChEMBL_1587941 (CHEMBL3824531)
IC50 1.000000±n/a nM
Citation Fraser, CDawson, JCDowling, RHouston, DRWeiss, JTMunro, AFMuir, MHarrington, LWebster, SPFrame, MCBrunton, VGPatton, EECarragher, NOUnciti-Broceta, A Rapid Discovery and Structure-Activity Relationships of Pyrazolopyrimidines That Potently Suppress Breast Cancer Cell Growth via SRC Kinase Inhibition with Exceptional Selectivity over ABL Kinase. J Med Chem59:4697-710 (2016) 
 
Proto-oncogene tyrosine-protein kinase Src
Name:Proto-oncogene tyrosine-protein kinase Src
Type:Protein
Mol. Mass.:59838.60
Organism:Homo sapiens (Human)
Description:P12931
Residue:536
BDBM50184785
NameBDBM50184785
Synonyms:CHEMBL3823620 | US10294227, Code 553
TypeSmall organic molecule
Emp. Form.C26H37N7O2
Mol. Mass.479.6177
SMILESCN(C)C1CCN(CCn2nc(-c3ccc(CC(=O)OC(C)(C)C)cc3)c3c(N)ncnc23)CC1