Reaction Details
TargetProtein polybromo-1
LigandBDBM50184981
Substrate/Competitorn/a
Meas. Tech.ChEMBL_1588199 (CHEMBL3825725)
Kd 170±n/a nM
Citation Sutherell, CLTallant, CMonteiro, OPYapp, CFuchs, JEFedorov, OSiejka, PMüller, SKnapp, SBrenton, JDBrennan, PELey, SV Identification and Development of 2,3-Dihydropyrrolo[1,2-a]quinazolin-5(1H)-one Inhibitors Targeting Bromodomains within the Switch/Sucrose Nonfermenting Complex. J Med Chem59:5095-101 (2016) 
 
Protein polybromo-1
Name:Protein polybromo-1
Type:PROTEIN
Mol. Mass.:192953.62
Organism:Homo sapiens (Human)
Description:ChEMBL_104264
Residue:1689
BDBM50184981
NameBDBM50184981
Synonyms:CHEMBL3823055
TypeSmall organic molecule
Emp. Form.C17H19ClN2O
Mol. Mass.302.799
SMILESCCC(CC)\C=C1/CCn2c1nc(=O)c1c(Cl)cccc21