Reaction Details
TargetBromodomain-containing protein 7
LigandBDBM50157607
Substrate/Competitorn/a
Meas. Tech.ChEMBL_1588282 (CHEMBL3826013)
Kd 909±n/a nM
Citation Karim, RMSchönbrunn, E An Advanced Tool To Interrogate BRD9. J Med Chem59:4459-61 (2016) 
 
Bromodomain-containing protein 7
Name:Bromodomain-containing protein 7
Type:PROTEIN
Mol. Mass.:74135.71
Organism:Homo sapiens (Human)
Description:ChEMBL_107970
Residue:651
BDBM50157607
NameBDBM50157607
Synonyms:CHEMBL3753082 | US11773085, Compound B24
TypeSmall organic molecule
Emp. Form.C26H30ClN3O4S
Mol. Mass.516.052
SMILESCC(C)CS(=O)(=O)N[C@H]1CCC(=O)N([C@@H]1c1ccc(Cl)cc1)c1ccc2c(C)cc(=O)n(C)c2c1