Reaction Details
TargetInsulin-like growth factor 1 receptor
LigandBDBM50185152
Substrate/Competitorn/a
Meas. Tech.ChEMBL_1587417 (CHEMBL3824710)
IC50 0.760000±n/a nM
Citation Huang, WSLiu, SZou, DThomas, MWang, YZhou, TRomero, JKohlmann, ALi, FQi, JCai, LDwight, TAXu, YXu, RDodd, RToms, AParillon, LLu, XAnjum, RZhang, SWang, FKeats, JWardwell, SDNing, YXu, QMoran, LEMohemmad, QKJang, HGClackson, TNarasimhan, NIRivera, VMZhu, XDalgarno, DShakespeare, WC Discovery of Brigatinib (AP26113), a Phosphine Oxide-Containing, Potent, Orally Active Inhibitor of Anaplastic Lymphoma Kinase. J Med Chem59:4948-64 (2016) 
 
Insulin-like growth factor 1 receptor
Name:Insulin-like growth factor 1 receptor
Type:Protein
Mol. Mass.:154776.79
Organism:Homo sapiens (Human)
Description:P08069
Residue:1367
BDBM50185152
NameBDBM50185152
Synonyms:CHEMBL3822475
TypeSmall organic molecule
Emp. Form.C28H36ClN7O3S
Mol. Mass.586.149
SMILESCOc1cc(ccc1Nc1ncc(Cl)c(Nc2ccccc2S(C)(=O)=O)n1)N1CCC(CC1)N1CCN(C)CC1