Reaction Details
TargetALK tyrosine kinase receptor
LigandBDBM50185267
Substrate/Competitorn/a
Meas. Tech.ChEMBL_1587416 (CHEMBL3824709)
IC50 0.490000±n/a nM
Citation Huang, WSLiu, SZou, DThomas, MWang, YZhou, TRomero, JKohlmann, ALi, FQi, JCai, LDwight, TAXu, YXu, RDodd, RToms, AParillon, LLu, XAnjum, RZhang, SWang, FKeats, JWardwell, SDNing, YXu, QMoran, LEMohemmad, QKJang, HGClackson, TNarasimhan, NIRivera, VMZhu, XDalgarno, DShakespeare, WC Discovery of Brigatinib (AP26113), a Phosphine Oxide-Containing, Potent, Orally Active Inhibitor of Anaplastic Lymphoma Kinase. J Med Chem59:4948-64 (2016) 
 
ALK tyrosine kinase receptor
Name:ALK tyrosine kinase receptor
Type:Protein
Mol. Mass.:176453.10
Organism:Homo sapiens (Human)
Description:Q9UM73
Residue:1620
BDBM50185267
NameBDBM50185267
Synonyms:CHEMBL3822557
TypeSmall organic molecule
Emp. Form.C28H36ClN6O3P
Mol. Mass.571.051
SMILESCOc1cc(ccc1Nc1ncc(Cl)c(Nc2ccccc2P(C)(C)=O)n1)N1CCC(CC1)N1CCOCC1