Reaction Details
TargetALK tyrosine kinase receptor
LigandBDBM50185280
Substrate/Competitorn/a
Meas. Tech.ChEMBL_1587416 (CHEMBL3824709)
IC50 0.180000±n/a nM
Citation Huang, WSLiu, SZou, DThomas, MWang, YZhou, TRomero, JKohlmann, ALi, FQi, JCai, LDwight, TAXu, YXu, RDodd, RToms, AParillon, LLu, XAnjum, RZhang, SWang, FKeats, JWardwell, SDNing, YXu, QMoran, LEMohemmad, QKJang, HGClackson, TNarasimhan, NIRivera, VMZhu, XDalgarno, DShakespeare, WC Discovery of Brigatinib (AP26113), a Phosphine Oxide-Containing, Potent, Orally Active Inhibitor of Anaplastic Lymphoma Kinase. J Med Chem59:4948-64 (2016) 
 
ALK tyrosine kinase receptor
Name:ALK tyrosine kinase receptor
Type:Protein
Mol. Mass.:176453.10
Organism:Homo sapiens (Human)
Description:Q9UM73
Residue:1620
BDBM50185280
NameBDBM50185280
Synonyms:CHEMBL3822611
TypeSmall organic molecule
Emp. Form.C24H30ClN6O2P
Mol. Mass.500.961
SMILESCOc1cc(ccc1Nc1ncc(Cl)c(Nc2ccccc2P(C)(C)=O)n1)N1CCN(C)CC1