Reaction Details
TargetALK tyrosine kinase receptor
LigandBDBM50185282
Substrate/Competitorn/a
Meas. Tech.ChEMBL_1587416 (CHEMBL3824709)
IC50 0.540000±n/a nM
Citation Huang, WSLiu, SZou, DThomas, MWang, YZhou, TRomero, JKohlmann, ALi, FQi, JCai, LDwight, TAXu, YXu, RDodd, RToms, AParillon, LLu, XAnjum, RZhang, SWang, FKeats, JWardwell, SDNing, YXu, QMoran, LEMohemmad, QKJang, HGClackson, TNarasimhan, NIRivera, VMZhu, XDalgarno, DShakespeare, WC Discovery of Brigatinib (AP26113), a Phosphine Oxide-Containing, Potent, Orally Active Inhibitor of Anaplastic Lymphoma Kinase. J Med Chem59:4948-64 (2016) 
 
ALK tyrosine kinase receptor
Name:ALK tyrosine kinase receptor
Type:Protein
Mol. Mass.:176453.10
Organism:Homo sapiens (Human)
Description:Q9UM73
Residue:1620
BDBM50185282
NameBDBM50185282
Synonyms:CHEMBL3823916
TypeSmall organic molecule
Emp. Form.C25H31ClN5O3P
Mol. Mass.515.972
SMILESCOc1cc(OC2CCN(C)CC2)ccc1Nc1ncc(Cl)c(Nc2ccccc2P(C)(C)=O)n1